BDBM50103693 CHEMBL432352::N-[4-(5-Amino-1-p-tolyl-1H-pyrazol-3-yl)-phenyl]-4-dimethylamino-benzenesulfonamide
SMILES CN(C)c1ccc(cc1)S(=O)(=O)Nc1ccc(cc1)-c1cc(N)n(n1)-c1ccc(C)cc1
InChI Key InChIKey=JFBFUYOBEDNFGP-UHFFFAOYSA-N
Data  1 IC50
  Tab Delimited (TSV)   2D SDfile   Computed 3D by Vconf -m prep SDfile
Find this compound or compounds like it in BindingDB:
Activity Spreadsheet -- Enzyme Inhibition Constant Data from BindingDB
Found 1 hit for monomerid = 50103693
TargetNeuropeptide Y receptor type 5(Homo sapiens (Human))
The R. W. Johnson Pharmaceutical Research Institute
Curated by ChEMBL
LigandPNGBDBM50103693(CHEMBL432352 | N-[4-(5-Amino-1-p-tolyl-1H-pyrazol-...)
Affinity DataIC50:  162nM. Assay description: Binding affinity towards human neuropeptide Y receptor type 5 in HEK 293 cell line, using [125I]-PYY as radioligand
In DepthDetails ArticlePubMed