BDBM50103713 CHEMBL73251::N-[4-(5-Amino-1-p-tolyl-1H-pyrazol-3-yl)-phenyl]-4-nitro-benzenesulfonamide
SMILES Cc1ccc(cc1)-n1nc(cc1N)-c1ccc(NS(=O)(=O)c2ccc(cc2)[N+]([O-])=O)cc1
InChI Key InChIKey=LLDXCXPWVDBVNS-UHFFFAOYSA-N
Data  1 IC50
  Tab Delimited (TSV)   2D SDfile   Computed 3D by Vconf -m prep SDfile
Find this compound or compounds like it in BindingDB:
Activity Spreadsheet -- Enzyme Inhibition Constant Data from BindingDB
Found 1 hit for monomerid = 50103713
TargetNeuropeptide Y receptor type 5(Homo sapiens (Human))
The R. W. Johnson Pharmaceutical Research Institute
Curated by ChEMBL
LigandPNGBDBM50103713(CHEMBL73251 | N-[4-(5-Amino-1-p-tolyl-1H-pyrazol-3...)
Affinity DataIC50:  79nM. Assay description: Binding affinity towards human neuropeptide Y receptor type 5 in HEK 293 cell line, using [125I]-PYY as radioligand
In DepthDetails ArticlePubMed