BDBM50103756 CHEMBL308634::dimer[Phosphoric acid mono-[(1R,2R,3S,4R,5S)-2,3-dihydroxy-4-(6-hydroxy-purin-9-yl)-bicyclo[3.1.0]hex-1-ylmethyl] ester]
SMILES O[C@@H]1[C@H](O)[C@]2(COP(O)(=O)OP(O)(=O)OC[C@@]34C[C@@H]3[C@H]([C@H](O)[C@@H]4O)n3cnc4c3nc[nH]c4=O)C[C@@H]2[C@H]1n1cnc2c1nc[nH]c2=O
InChI Key InChIKey=HKLYEPRMHJKRRV-YAZKJGFISA-N
Data  1 KI
  Tab Delimited (TSV)   2D SDfile   Computed 3D by Vconf -m prep SDfile
Find this compound or compounds like it in BindingDB:
Activity Spreadsheet -- Enzyme Inhibition Constant Data from BindingDB
Found 1 hit for monomerid = 50103756
TargetAdenosine receptor A3(Homo sapiens (Human))
Niddk
Curated by ChEMBL
LigandPNGBDBM50103756(CHEMBL308634 | dimer[Phosphoric acid mono-[(1R,2R,...)
Affinity DataKi:  2.16E+4nM. Assay description: Displacement of [125I]-AB-MECA from human Adenosine A3 receptor expressed in HEK-293 cell membranes
In DepthDetails ArticlePubMed