BDBM50103857 2-{[2-(5-Carbamoyl-1H-benzoimidazol-2-ylmethyl)-3-methyl-3H-benzoimidazole-5-carbonyl]-amino}-4-carboxy-pentanedioic acid::CHEMBL78024
SMILES Cn1c(Cc2nc3ccc(cc3[nH]2)C(N)=O)nc2ccc(cc12)C(=O)NC(CC(C(O)=O)C(O)=O)C(O)=O
InChI Key InChIKey=VZUGLLAFZGKIJA-UHFFFAOYSA-N
Data  1 IC50
  Tab Delimited (TSV)   2D SDfile   Computed 3D by Vconf -m prep SDfile
Find this compound or compounds like it in BindingDB:
Activity Spreadsheet -- Enzyme Inhibition Constant Data from BindingDB
Found 1 hit for monomerid = 50103857
TargetGenome polyprotein(Hepatitis C virus)
Bristol-Myers Squibb Pharmaceutical Research Institute
Curated by ChEMBL
LigandPNGBDBM50103857(2-{[2-(5-Carbamoyl-1H-benzoimidazol-2-ylmethyl)-3-...)
Affinity DataIC50:  2.60E+3nM. Assay description: Inhibitory activity against hepatitis C virus (HCV) NS3 protease in the presence of Zn2+.
In DepthDetails ArticlePubMed