BDBM50104252 CHEMBL309619::{1-[(S)-4-(Benzenesulfonyl-methyl-amino)-3-phenyl-butyl]-piperidin-4-yl}-methyl-carbamic acid benzyl ester
SMILES CN(C[C@@H](CCN1CCC(CC1)N(C)C(=O)OCc1ccccc1)c1ccccc1)S(=O)(=O)c1ccccc1
InChI Key InChIKey=NWQXLBPAPDKSFG-MUUNZHRXSA-N
Data  2 IC50
  Tab Delimited (TSV)   2D SDfile   Computed 3D by Vconf -m prep SDfile
Find this compound or compounds like it in BindingDB:
Activity Spreadsheet -- Enzyme Inhibition Constant Data from BindingDB
Found 2 hits for monomerid = 50104252
TargetC-C chemokine receptor type 5(Homo sapiens (Human))TBA
LigandPNGBDBM50104252(CHEMBL309619 | {1-[(S)-4-(Benzenesulfonyl-methyl-a...)
Affinity DataIC50:  5nM. Assay description: Antagonist activity at Homo sapiens (human) CCR5 receptor
In DepthDetails Article
TargetC-C chemokine receptor type 5(Homo sapiens (Human))TBA
LigandPNGBDBM50104252(CHEMBL309619 | {1-[(S)-4-(Benzenesulfonyl-methyl-a...)
Affinity DataIC50:  5nM. Assay description: Inhibition of [125I]-MIP-1 alpha binding to human CCR5 receptor expressed in Chinese hamster ovary (CHO) cells
In DepthDetails ArticlePubMed