BDBM50104306 2-Aminomethyl-pyrrolidine-3,4-diol::CHEMBL79727
SMILES NCC1NCC(O)C1O
InChI Key InChIKey=PTUICKYMXFZVGV-UHFFFAOYSA-N
Data  1 KI  2 IC50
  Tab Delimited (TSV)   2D SDfile   Computed 3D by Vconf -m prep SDfile
Find this compound or compounds like it in BindingDB:
Activity Spreadsheet -- Enzyme Inhibition Constant Data from BindingDB
Found 3 hits for monomerid = 50104306
Targetalpha-1,2-Mannosidase(Glycine max)
Section De Chimie De L'Universit£
Curated by ChEMBL
LigandPNGBDBM50104306(2-Aminomethyl-pyrrolidine-3,4-diol | CHEMBL79727)
Affinity DataKi:  5.30E+4nM. Assay description: Inhibitory activity towards Alpha-mannosidase from Jack bean
In DepthDetails ArticlePubMed
Targetalpha-1,2-Mannosidase(Glycine max)
Section De Chimie De L'Universit£
Curated by ChEMBL
LigandPNGBDBM50104306(2-Aminomethyl-pyrrolidine-3,4-diol | CHEMBL79727)
Affinity DataIC50:  1.70E+5nM. Assay description: Inhibitory activity towards Beta-Glucosidase from Almond
In DepthDetails ArticlePubMed
Targetalpha-1,2-Mannosidase(Glycine max)
Section De Chimie De L'Universit£
Curated by ChEMBL
LigandPNGBDBM50104306(2-Aminomethyl-pyrrolidine-3,4-diol | CHEMBL79727)
Affinity DataIC50:  1.00E+6nM. Assay description: Inhibitory activity towards Alpha-mannosidase from Almond
In DepthDetails ArticlePubMed