BDBM50104307 2-(Benzylamino-methyl)-pyrrolidine-3,4-diol::CHEMBL84104
SMILES OC1CNC(CNCc2ccccc2)C1O
InChI Key InChIKey=SXQQUIDMNYCBEU-UHFFFAOYSA-N
Data  2 KI  3 IC50
  Tab Delimited (TSV)   2D SDfile   Computed 3D by Vconf -m prep SDfile
Find this compound or compounds like it in BindingDB:
Activity Spreadsheet -- Enzyme Inhibition Constant Data from BindingDB
Found 5 hits for monomerid = 50104307
Targetalpha-1,2-Mannosidase(Glycine max)
Section De Chimie De L'Universit£
Curated by ChEMBL
LigandPNGBDBM50104307(2-(Benzylamino-methyl)-pyrrolidine-3,4-diol | CHEM...)
Affinity DataKi:  7.40E+3nM. Assay description: Inhibitory activity towards Alpha-mannosidase from Jack bean
In DepthDetails ArticlePubMed
Targetalpha-1,2-Mannosidase(Glycine max)
Section De Chimie De L'Universit£
Curated by ChEMBL
LigandPNGBDBM50104307(2-(Benzylamino-methyl)-pyrrolidine-3,4-diol | CHEM...)
Affinity DataKi:  7.10E+4nM. Assay description: Inhibitory activity towards Beta-galactosidase from Jack bean
In DepthDetails ArticlePubMed
Targetalpha-1,2-Mannosidase(Glycine max)
Section De Chimie De L'Universit£
Curated by ChEMBL
LigandPNGBDBM50104307(2-(Benzylamino-methyl)-pyrrolidine-3,4-diol | CHEM...)
Affinity DataIC50:  2.30E+5nM. Assay description: Inhibitory activity towards Alpha-glucosidase from Rhizopus mold (amyloglucosidase)
In DepthDetails ArticlePubMed
TargetBeta-glucosidase(Prunus avium)
Section De Chimie De L'Universit£
Curated by ChEMBL
LigandPNGBDBM50104307(2-(Benzylamino-methyl)-pyrrolidine-3,4-diol | CHEM...)
Affinity DataIC50:  3.70E+5nM. Assay description: Inhibitory activity towards Beta-Glucosidase from Almond
In DepthDetails ArticlePubMed
Targetalpha-1,2-Mannosidase(Glycine max)
Section De Chimie De L'Universit£
Curated by ChEMBL
LigandPNGBDBM50104307(2-(Benzylamino-methyl)-pyrrolidine-3,4-diol | CHEM...)
Affinity DataIC50:  6.00E+4nM. Assay description: Inhibitory activity towards Alpha-mannosidase from Almond
In DepthDetails ArticlePubMed