BDBM50104309 2-[((R)-1-Phenyl-ethylamino)-methyl]-pyrrolidine-3,4-diol::CHEMBL309850
SMILES C[C@@H](NCC1NCC(O)C1O)c1ccccc1
InChI Key InChIKey=WMPOZDRIYMQHEX-HNLWRCSVSA-N
Data  1 KI  1 IC50
  Tab Delimited (TSV)   2D SDfile   Computed 3D by Vconf -m prep SDfile
Find this compound or compounds like it in BindingDB:
Activity Spreadsheet -- Enzyme Inhibition Constant Data from BindingDB
Found 2 hits for monomerid = 50104309
Targetalpha-1,2-Mannosidase(Glycine max)
Section De Chimie De L'Universit£
Curated by ChEMBL
LigandPNGBDBM50104309(2-[((R)-1-Phenyl-ethylamino)-methyl]-pyrrolidine-3...)
Affinity DataKi:  1.70E+5nM. Assay description: Inhibitory activity towards Alpha-mannosidase from Jack bean
In DepthDetails ArticlePubMed
Targetalpha-1,2-Mannosidase(Glycine max)
Section De Chimie De L'Universit£
Curated by ChEMBL
LigandPNGBDBM50104309(2-[((R)-1-Phenyl-ethylamino)-methyl]-pyrrolidine-3...)
Affinity DataIC50:  4.40E+5nM. Assay description: Inhibitory activity towards Beta-Glucosidase from Almond
In DepthDetails ArticlePubMed