BDBM50104496 (R)-4-Amino-4-[(R)-1-{12-[(2-chloro-phenoxy)-hydroxy-phosphoryloxy]-dodecylcarbamoyl}-2-(1H-indol-3-yl)-ethylcarbamoyl]-butyric acid; compound with triethyl-amine::CHEMBL313673
SMILES N[C@H](CCC(O)=O)C(=O)N[C@H](Cc1c[nH]c2ccccc12)C(=O)NCCCCCCCCCCCCOP(O)(=O)Oc1ccccc1Cl
InChI Key InChIKey=JMDWSQUVOGWZSU-PQHLKRTFSA-N
Data  1 IC50
  Tab Delimited (TSV)   2D SDfile   Computed 3D by Vconf -m prep SDfile
Find this compound or compounds like it in BindingDB:
Activity Spreadsheet -- Enzyme Inhibition Constant Data from BindingDB
Found 1 hit for monomerid = 50104496
TargetTelomerase reverse transcriptase(Homo sapiens (Human))
Kyushu University
Curated by ChEMBL
LigandPNGBDBM50104496((R)-4-Amino-4-[(R)-1-{12-[(2-chloro-phenoxy)-hydro...)
Affinity DataIC50: >1.00E+5nM. Assay description: Inhibitory activity against telomerase extracted from HCT 116 cell lines
In DepthDetails ArticlePubMed