BDBM50104510 3-[1-(4-Bromo-phenyl)-meth-(Z)-ylidene]-6-[1-[5-(2-dimethylamino-ethylsulfanyl)-thiophen-2-yl]-meth-(Z)-ylidene]-piperazine-2,5-dione::CHEMBL86497
SMILES CN(C)CCSc1ccc(\C=c2/[nH]c(=O)\c(=C\c3ccc(Br)cc3)[nH]c2=O)s1
InChI Key InChIKey=FZOQUHWZXQBDCH-LSQIQBGYSA-N
Data  1 IC50
  Tab Delimited (TSV)   2D SDfile   Computed 3D by Vconf -m prep SDfile
Find this compound or compounds like it in BindingDB:
Activity Spreadsheet -- Enzyme Inhibition Constant Data from BindingDB
Found 1 hit for monomerid = 50104510
TargetPlasminogen activator inhibitor 1(Homo sapiens (Human))
Xenova
Curated by ChEMBL
LigandPNGBDBM50104510(3-[1-(4-Bromo-phenyl)-meth-(Z)-ylidene]-6-[1-[5-(2...)
Affinity DataIC50:  1.31E+4nM. Assay description: Inhibitory activity of compound against Plasminogen activator inhibitor-1
In DepthDetails ArticlePubMed