BDBM50104797 CHEMBL3597514
SMILES N[C@@H](Cc1ccc(O)cc1)C(=O)N[C@@H](CCCNC(N)=N)C(=O)N[C@@H](CCCNC(N)=N)C(=O)N[C@@H](CCCNC(N)=N)C(=O)N[C@@H](CCCNC(N)=N)C(=O)N[C@@H](CCCNC(N)=N)C(=O)N[C@@H](CCCNC(N)=N)C(=O)N[C@@H](CCCNC(N)=N)C(N)=O
InChI Key InChIKey=ASRNEBBSMRFCLK-VTGDPKQBSA-N
Data  1 IC50
  Tab Delimited (TSV)   2D SDfile   Computed 3D by Vconf -m prep SDfile
Find this compound or compounds like it in BindingDB:
Activity Spreadsheet -- Enzyme Inhibition Constant Data from BindingDB
Found 1 hit for monomerid = 50104797
TargetEstrogen receptor(Homo sapiens (Human))
National Institute Of Health Sciences
Curated by ChEMBL
LigandPNGBDBM50104797(CHEMBL3597514)
Affinity DataIC50: >1.00E+3nM. Assay description: Inhibition of estrogen receptor alpha (unknown origin)-SRC1 coactivator interaction incubated for 1 hr by receptor cofactor assay system based method
In DepthDetails ArticlePubMed