BDBM50104862 CHEMBL110637::N-[3-(4-Fluoro-3-isopropyl-phenyl)-2,2-dimethyl-cyclopropanecarbonyl]-guanidine
SMILES CC(C)c1cc(ccc1F)[C@@H]1[C@@H](C(=O)NC(N)=N)C1(C)C
InChI Key InChIKey=BVBBTALDVJAPQI-OLZOCXBDSA-N
Data  1 IC50
  Tab Delimited (TSV)   2D SDfile   Computed 3D by Vconf -m prep SDfile
Find this compound or compounds like it in BindingDB:
Activity Spreadsheet -- Enzyme Inhibition Constant Data from BindingDB
Found 1 hit for monomerid = 50104862
TargetSodium/hydrogen exchanger 1(Homo sapiens (Human))
Bristol-Myers Squibb Pharmaceutical Research Institute
Curated by ChEMBL
LigandPNGBDBM50104862(CHEMBL110637 | N-[3-(4-Fluoro-3-isopropyl-phenyl)-...)
Affinity DataIC50:  17nM. Assay description: Screened in AP1 cells expressing human NHE-1 for sodium hydrogen exchange activity
In DepthDetails ArticlePubMed