BDBM50104902 7-Methyl-4-phenyl-chroman-2-one::CHEMBL109925
SMILES Cc1ccc2C(CC(=O)Oc2c1)c1ccccc1
InChI Key InChIKey=DVIONHZDAYXRBA-UHFFFAOYSA-N
Data  1 IC50
  Tab Delimited (TSV)   2D SDfile   Computed 3D by Vconf -m prep SDfile
Find this compound or compounds like it in BindingDB:
Activity Spreadsheet -- Enzyme Inhibition Constant Data from BindingDB
Found 1 hit for monomerid = 50104902
TargetAldehyde dehydrogenase, mitochondrial(Homo sapiens (Human))
Harvard Medical School
Curated by ChEMBL
LigandPNGBDBM50104902(7-Methyl-4-phenyl-chroman-2-one | CHEMBL109925)
Affinity DataIC50:  1.50E+3nM. Assay description: Inhibition of hamster liver aldehyde dehydrogenase ALDH-2
In DepthDetails ArticlePubMed