BDBM50105023 4-tert-Butyl-N-[6-(2-methoxy-ethoxy)-5-(3-methoxy-phenoxy)-pyrimidin-4-yl]-benzenesulfonamide::CHEMBL114985
SMILES COCCOc1ncnc(NS(=O)(=O)c2ccc(cc2)C(C)(C)C)c1Oc1cccc(OC)c1
InChI Key InChIKey=QBDMBJQWKVYOAA-UHFFFAOYSA-N
Data  1 IC50
  Tab Delimited (TSV)   2D SDfile   Computed 3D by Vconf -m prep SDfile
Find this compound or compounds like it in BindingDB:
Activity Spreadsheet -- Enzyme Inhibition Constant Data from BindingDB
Found 1 hit for monomerid = 50105023
TargetEndothelin-1 receptor(Sus scrofa)
Tanabe Seiyaku
Curated by ChEMBL
LigandPNGBDBM50105023(4-tert-Butyl-N-[6-(2-methoxy-ethoxy)-5-(3-methoxy-...)
Affinity DataIC50:  92nM. Assay description: In vitro inhibition of [125I]-ET-1 binding to Endothelin A receptor in porcine aortic membrane from endothelial cells
In DepthDetails ArticlePubMed