BDBM50105289 2-[4-(4-Fluoro-benzyl)-7-methoxy-naphthalen-1-yl]-propionic acid::CHEMBL90171
SMILES COc1ccc2c(Cc3ccc(F)cc3)ccc(C(C)C(O)=O)c2c1
InChI Key InChIKey=NXHGWIZWCITRLY-UHFFFAOYSA-N
Data  2 IC50
  Tab Delimited (TSV)   2D SDfile   Computed 3D by Vconf -m prep SDfile
Find this compound or compounds like it in BindingDB:
Activity Spreadsheet -- Enzyme Inhibition Constant Data from BindingDB
Found 2 hits for monomerid = 50105289
TargetProstaglandin G/H synthase 2(RAT)
RhôNe-Poulenc Rorer
Curated by ChEMBL
LigandPNGBDBM50105289(2-[4-(4-Fluoro-benzyl)-7-methoxy-naphthalen-1-yl]-...)
Affinity DataIC50:  740nM. Assay description: In vitro inhibitory concentration against rat Prostaglandin G/H synthase 2
In DepthDetails ArticlePubMed
TargetProstaglandin G/H synthase 1(RAT)
RhôNe-Poulenc Rorer
Curated by ChEMBL
LigandPNGBDBM50105289(2-[4-(4-Fluoro-benzyl)-7-methoxy-naphthalen-1-yl]-...)
Affinity DataIC50:  1.70E+3nM. Assay description: In vitro inhibitory concentration against rat prostaglandin G/H synthase 1
In DepthDetails ArticlePubMed