BDBM50105509 (4-Chloro-phenyl)-[(3S,4S)-3-phenyl-4-(4-phenyl-piperidin-1-ylmethyl)-pyrrolidin-1-yl]-methanone::CHEMBL316073
SMILES Clc1ccc(cc1)C(=O)N1C[C@H](CN2CCC(CC2)c2ccccc2)[C@H](C1)c1ccccc1
InChI Key InChIKey=AAEHNXBQLULMSR-XTEPFMGCSA-N
Data  1 IC50
  Tab Delimited (TSV)   2D SDfile   Computed 3D by Vconf -m prep SDfile
Find this compound or compounds like it in BindingDB:
Activity Spreadsheet -- Enzyme Inhibition Constant Data from BindingDB
Found 1 hit for monomerid = 50105509
TargetC-C chemokine receptor type 5(Homo sapiens (Human))
Merck Research Laboratories
Curated by ChEMBL
LigandPNGBDBM50105509((4-Chloro-phenyl)-[(3S,4S)-3-phenyl-4-(4-phenyl-pi...)
Affinity DataIC50:  750nM. Assay description: Inhibitory concentration, binding towards C-C chemokine receptor type 5 using [125I]-MIP-1 alpha as radioligand expressed on CHO cells
In DepthDetails ArticlePubMed