BDBM50105568 1-Methyl-6-(3-nitro-phenyl)-1,3-dihydro-benzoimidazol-2-one::CHEMBL92354
SMILES Cn1c2c[c-](ccc2nc1=[OH+])-c1cccc(c1)[N+]([O-])=O
InChI Key InChIKey=GQRPHURUYZOXJO-UHFFFAOYSA-O
Data  1 KI  2 IC50
  Tab Delimited (TSV)   2D SDfile   Computed 3D by Vconf -m prep SDfile
Find this compound or compounds like it in BindingDB:
Activity Spreadsheet -- Enzyme Inhibition Constant Data from BindingDB
Found 3 hits for monomerid = 50105568
TargetProgesterone receptor(Homo sapiens (Human))
Wyeth-Ayerst Research
Curated by ChEMBL
LigandPNGBDBM50105568(1-Methyl-6-(3-nitro-phenyl)-1,3-dihydro-benzoimida...)
Affinity DataKi: >1.00E+4nM. Assay description: Binding affinity towards progesterone receptor was measured
In DepthDetails ArticlePubMed
TargetProgesterone receptor(Homo sapiens (Human))
Wyeth-Ayerst Research
Curated by ChEMBL
LigandPNGBDBM50105568(1-Methyl-6-(3-nitro-phenyl)-1,3-dihydro-benzoimida...)
Affinity DataIC50:  1.00E+3nM. Assay description: Inhibitory concentration against progesterone stimulated alkaline phosphatase activity in T47D human breast carcinoma cell line
In DepthDetails ArticlePubMed
TargetProgesterone receptor(Homo sapiens (Human))
Wyeth-Ayerst Research
Curated by ChEMBL
LigandPNGBDBM50105568(1-Methyl-6-(3-nitro-phenyl)-1,3-dihydro-benzoimida...)
Affinity DataIC50:  1.53E+3nM. Assay description: Inhibitory concentration against progesterone induced PRE-luciferase activity in CV-cells
In DepthDetails ArticlePubMed