BDBM50105749 4-[5-(4-Fluoro-phenyl)-3-(1-isopropyl-piperidin-4-yl)-3H-imidazol-4-yl]-pyrimidin-2-ylamine::CHEMBL95206::D3RKN_60
SMILES CC(C)N1CCC(CC1)n1cnc(c1-c1ccnc(N)n1)-c1ccc(F)cc1
InChI Key InChIKey=NDRPTJVBXDZQSJ-UHFFFAOYSA-N
Data  1 IC50  2 Kd
  Tab Delimited (TSV)   2D SDfile   Computed 3D by Vconf -m prep SDfile
Find this compound or compounds like it in BindingDB:
Activity Spreadsheet -- Enzyme Inhibition Constant Data from BindingDB
Found 3 hits for monomerid = 50105749
TargetMitogen-activated protein kinase 14(Homo sapiens (Human))
Glaxosmithkline
Curated by ChEMBL
LigandPNGBDBM50105749(4-[5-(4-Fluoro-phenyl)-3-(1-isopropyl-piperidin-4-...)
Affinity DataIC50:  170nM. Assay description: Inhibition against Mitogen-activated protein kinase p38 alpha
In DepthDetails ArticlePubMed
TargetTyrosine-protein kinase JAK2(Homo sapiens (Human))
D3R/Abbott
LigandPNGBDBM50105749(4-[5-(4-Fluoro-phenyl)-3-(1-isopropyl-piperidin-4-...)
Affinity DataKd:  4.70E+3nM. Assay description: D3R2022
In DepthDetails PubMed
TargetVascular endothelial growth factor receptor 2(Homo sapiens (Human))
D3R/Abbott
LigandPNGBDBM50105749(4-[5-(4-Fluoro-phenyl)-3-(1-isopropyl-piperidin-4-...)
Affinity DataKd:  1.00E+4nM. Assay description: D3R2021
In DepthDetails PubMed