BDBM50105874 CHEMBL3597814
SMILES CC(C1CCNCC1)C(=O)CN(CC(=O)NCCN1CCCC1)c1cc(Cl)ccc1Oc1ccc(Cl)cc1
InChI Key InChIKey=FCTFEUIEVFKITO-UHFFFAOYSA-N
Data  1 IC50
  Tab Delimited (TSV)   2D SDfile   Computed 3D by Vconf -m prep SDfile
Find this compound or compounds like it in BindingDB:
Activity Spreadsheet -- Enzyme Inhibition Constant Data from BindingDB
Found 1 hit for monomerid = 50105874
TargetAdenosylhomocysteinase(Homo sapiens (Human))
Mitsubishi Tanabe Pharma
Curated by ChEMBL
LigandPNGBDBM50105874(CHEMBL3597814)
Affinity DataIC50: >1.00E+5nM. Assay description: Inhibition of recombinant human S-adenosyl-L-homocysteine hydrolase assessed as hydrolysis of AdoHcy after 8 mins by HPLC analysis
In DepthDetails ArticlePubMed