BDBM50105901 CHEMBL3597832
SMILES Cl.CCNCCNC(=O)CN(CC(=O)N(C)N1Cc2ccccc2C1)c1cc(Cl)ccc1Oc1ccc(Cl)cc1
InChI Key InChIKey=LEEQRWUADCNPQP-UHFFFAOYSA-N
Data  1 IC50
  Tab Delimited (TSV)   2D SDfile   Computed 3D by Vconf -m prep SDfile
Find this compound or compounds like it in BindingDB:
Activity Spreadsheet -- Enzyme Inhibition Constant Data from BindingDB
Found 1 hit for monomerid = 50105901
TargetAdenosylhomocysteinase(Homo sapiens (Human))
Mitsubishi Tanabe Pharma
Curated by ChEMBL
LigandPNGBDBM50105901(CHEMBL3597832)
Affinity DataIC50:  8.5nM. Assay description: Inhibition of recombinant human S-adenosyl-L-homocysteine hydrolase assessed as hydrolysis of AdoHcy after 8 mins by HPLC analysis
In DepthDetails ArticlePubMed