BDBM50105981 CHEMBL3598052
SMILES [2H]C([2H])([2H])N(C(=O)c1c(Cl)cccc1Cl)c1ccc(cc1N1CC2CC2C1)-c1cc(NC(C)=O)nn1C(C)C
InChI Key InChIKey=ZWHNWMJLCJLVSY-UHFFFAOYSA-N
Data  1 IC50  5 EC50
  Tab Delimited (TSV)   2D SDfile   Computed 3D by Vconf -m prep SDfile
Find this compound or compounds like it in BindingDB:
Activity Spreadsheet -- Enzyme Inhibition Constant Data from BindingDB
Found 6 hits for monomerid = 50105981
TargetNuclear receptor ROR-gamma(Homo sapiens (Human))
Biogen
Curated by ChEMBL
LigandPNGBDBM50105981(CHEMBL3598052)
Affinity DataIC50:  3.40nM. Assay description: Binding affinity to GST-tagged RORgamma LBD (unknown origin) assessed as inhibition of interaction with co-activatior peptide TRAP220 preincubated fo...
In DepthDetails ArticlePubMed
TargetNuclear receptor ROR-gamma(Homo sapiens (Human))
Biogen
Curated by ChEMBL
LigandPNGBDBM50105981(CHEMBL3598052)
Affinity DataEC50:  6.10nM. Assay description: Inverse agonist activity at RORgamma (unknown origin) transfected in HEK293T cells after 16 to 20 hrs by GAL4 luciferase reporter gene assay
In DepthDetails ArticlePubMed
TargetNuclear receptor subfamily 1 group I member 2(Homo sapiens (Human))
Biogen
Curated by ChEMBL
LigandPNGBDBM50105981(CHEMBL3598052)
Affinity DataEC50:  500nM. Assay description: Activation of PXR (unknown origin)
In DepthDetails ArticlePubMed
TargetNuclear receptor ROR-alpha(Homo sapiens (Human))
Biogen
Curated by ChEMBL
LigandPNGBDBM50105981(CHEMBL3598052)
Affinity DataEC50:  1.50E+3nM. Assay description: Inverse agonist activity at RORalpha (unknown origin)
In DepthDetails ArticlePubMed
TargetNuclear receptor ROR-beta(Homo sapiens (Human))
Biogen
Curated by ChEMBL
LigandPNGBDBM50105981(CHEMBL3598052)
Affinity DataEC50:  600nM. Assay description: Inverse agonist activity at RORbeta (unknown origin)
In DepthDetails ArticlePubMed
TargetNuclear receptor ROR-gamma(Mus musculus)
Biogen
Curated by ChEMBL
LigandPNGBDBM50105981(CHEMBL3598052)
Affinity DataEC50:  73nM. Assay description: Inverse agonist activity at RORgamma in C57BL/6 mouse splenocytes assessed as reduction of IL-17 production after 2 days by ELISA
In DepthDetails ArticlePubMed