BDBM50106041 (S)-2-((1S,2R,6S,7R)-3,5-Dioxo-10-oxa-4-aza-tricyclo[5.2.1.0*2,6*]dec-4-yl)-3-(3H-imidazol-4-yl)-propionic acid::CHEMBL100883
SMILES OC(=O)[C@H](Cc1cnc[nH]1)N1C(=O)[C@H]2[C@@H]3CC[C@@H](O3)[C@H]2C1=O
InChI Key InChIKey=OFGIVLPLQBBJEK-QUARPLMYSA-N
Data  2 IC50
  Tab Delimited (TSV)   2D SDfile   Computed 3D by Vconf -m prep SDfile
Find this compound or compounds like it in BindingDB:
Activity Spreadsheet -- Enzyme Inhibition Constant Data from BindingDB
Found 2 hits for monomerid = 50106041
TargetProtein phosphatase 1B(Homo sapiens (Human))
The University Of Newcastle
Curated by ChEMBL
LigandPNGBDBM50106041((S)-2-((1S,2R,6S,7R)-3,5-Dioxo-10-oxa-4-aza-tricyc...)
Affinity DataIC50:  2.82E+3nM. Assay description: Inhibitory concentration against protein phosphatase 1 (PP1) was determined
In DepthDetails ArticlePubMed
TargetSerine/threonine-protein phosphatase 2A 55 kDa regulatory subunit B(Gallus gallus)
The University Of Newcastle
Curated by ChEMBL
LigandPNGBDBM50106041((S)-2-((1S,2R,6S,7R)-3,5-Dioxo-10-oxa-4-aza-tricyc...)
Affinity DataIC50:  1.35E+3nM. Assay description: Inhibitory concentration against protein phosphatase 2A (PP2A) was determined
In DepthDetails ArticlePubMed