BDBM50106148 5-amino-1-[2,6-dichloro-4-(trifluoromethyl)phenyl]-4-[(trifluoromethyl)sulfinyl]-1H-pyrazole-3-carbonitrile::CHEMBL101326::Fipronil
SMILES Nc1c(c(nn1-c1c(Cl)cc(cc1Cl)C(F)(F)F)C#N)S(=O)C(F)(F)F
InChI Key InChIKey=ZOCSXAVNDGMNBV-UHFFFAOYSA-N
Data  2 IC50
PDB links: 1 PDB ID matches this monomer.
  Tab Delimited (TSV)   2D SDfile   Computed 3D by Vconf -m prep SDfile
Find this compound or compounds like it in BindingDB:
Activity Spreadsheet -- Enzyme Inhibition Constant Data from BindingDB
Found 3 hits for monomerid = 50106148
TargetGamma-aminobutyric acid receptor subunit beta-3(Homo sapiens (Human))
University Of California
Curated by ChEMBL
LigandPNGBDBM50106148(5-amino-1-[2,6-dichloro-4-(trifluoromethyl)phenyl]...)
Affinity DataIC50:  28nM. Assay description: Inhibition of [3H]-EBOB binding to drosophila GABA-A receptor (range 1-28)
In DepthDetails ArticlePubMed
TargetNuclear receptor subfamily 1 group I member 2(Homo sapiens (Human))TBA
LigandPNGBDBM50106148(5-amino-1-[2,6-dichloro-4-(trifluoromethyl)phenyl]...)
Affinity DataEC50:  1.50E+4nM
In DepthDetails PDB3D3D Structure (crystal)
TargetGamma-aminobutyric acid receptor subunit beta-3(Homo sapiens (Human))
University Of California
Curated by ChEMBL
LigandPNGBDBM50106148(5-amino-1-[2,6-dichloro-4-(trifluoromethyl)phenyl]...)
Affinity DataIC50:  28nM. Assay description: Inhibition of [3H]-EBOB binding to drosophila GABA-A receptor (range 1-28)
In DepthDetails ArticlePubMed