BDBM50106215 CHEMBL3598108
SMILES CS(=O)(=O)c1cnc(O[C@H]2CC[C@@H](CC2)OC2CCN(CC3(CC3)C(F)(F)F)CC2)cn1
InChI Key InChIKey=ANIDPORIGUTQGM-WKILWMFISA-N
Data  2 EC50
  Tab Delimited (TSV)   2D SDfile   Computed 3D by Vconf -m prep SDfile
Find this compound or compounds like it in BindingDB:
Activity Spreadsheet -- Enzyme Inhibition Constant Data from BindingDB
Found 2 hits for monomerid = 50106215
TargetGlucose-dependent insulinotropic receptor(Rattus norvegicus)
Arena Pharmaceuticals
Curated by ChEMBL
LigandPNGBDBM50106215(CHEMBL3598108)
Affinity DataEC50:  163nM. Assay description: Agonist activity at rat GPR119 by HTRF cAMP assay
In DepthDetails ArticlePubMed
TargetGlucose-dependent insulinotropic receptor(Homo sapiens (Human))
Arena Pharmaceuticals
Curated by ChEMBL
LigandPNGBDBM50106215(CHEMBL3598108)
Affinity DataEC50:  63nM. Assay description: Agonist activity at human GPR119 by HTRF cAMP assay
In DepthDetails ArticlePubMed