BDBM50106288 CHEMBL3598149::US9550771, Example 28
SMILES OC(=O)c1ccc(-c2nc(C(=O)c3c(Cl)cccc3C(F)(F)F)n3ccccc23)c(F)c1
InChI Key InChIKey=LTTBADSZQZHNMO-UHFFFAOYSA-N
Data  1 IC50  9 EC50
  Tab Delimited (TSV)   2D SDfile   Computed 3D by Vconf -m prep SDfile
Find this compound or compounds like it in BindingDB:
Activity Spreadsheet -- Enzyme Inhibition Constant Data from BindingDB
Found 10 hits for monomerid = 50106288
TargetNuclear receptor ROR-beta(Homo sapiens (Human))
Genentech
Curated by ChEMBL
LigandPNGBDBM50106288(CHEMBL3598149 | US9550771, Example 28)
Affinity DataEC50: >1.00E+4nM. Assay description: Inverse agonist activity at GAL4-fused human RORb expressed in HEK293T cells assessed as suppression of basal transcriptional activity after 20 hrs b...
In DepthDetails ArticlePubMed
TargetNuclear receptor ROR-alpha(Homo sapiens (Human))
Genentech
Curated by ChEMBL
LigandPNGBDBM50106288(CHEMBL3598149 | US9550771, Example 28)
Affinity DataEC50: >1.00E+4nM. Assay description: Inverse agonist activity at GAL4-fused human RORa expressed in HEK293T cells assessed as suppression of basal transcriptional activity after 20 hrs b...
In DepthDetails ArticlePubMed
TargetBile acid receptor(Homo sapiens (Human))
Genentech
Curated by ChEMBL
LigandPNGBDBM50106288(CHEMBL3598149 | US9550771, Example 28)
Affinity DataEC50: >1.00E+4nM. Assay description: Agonist activity at GAL4-fused human FXR expressed in HEK293T cells assessed as activation of basal transcriptional activity after 20 hrs by dual-glo...
In DepthDetails ArticlePubMed
TargetOxysterols receptor LXR-beta(Homo sapiens (Human))
Genentech
Curated by ChEMBL
LigandPNGBDBM50106288(CHEMBL3598149 | US9550771, Example 28)
Affinity DataEC50: >1.00E+4nM. Assay description: Agonist activity at GAL4-fused human LXRbeta expressed in HEK293T cells assessed as activation of basal transcriptional activity after 20 hrs by dual...
In DepthDetails ArticlePubMed
TargetNuclear receptor ROR-gamma [262-507](Homo sapiens (Human))
Genentech
US Patent
LigandPNGBDBM50106288(CHEMBL3598149 | US9550771, Example 28)
Affinity DataEC50:  9nMT: 2°C. Assay description: ssays were carried out in 16-μL reaction volumes in black 384 Plus F Proxiplates (Perkin-Elmer 6008269). All assay components except test ligand...
In DepthDetails US Patent
TargetNuclear receptor subfamily 1 group I member 2(Homo sapiens (Human))
Genentech
Curated by ChEMBL
LigandPNGBDBM50106288(CHEMBL3598149 | US9550771, Example 28)
Affinity DataEC50: >1.00E+4nM. Assay description: Agonist activity at GAL4-fused human PXR expressed in HEK293T cells assessed as activation of basal transcriptional activity after 20 hrs by dual-glo...
In DepthDetails ArticlePubMed
TargetPeroxisome proliferator-activated receptor gamma(Homo sapiens (Human))
Genentech
Curated by ChEMBL
LigandPNGBDBM50106288(CHEMBL3598149 | US9550771, Example 28)
Affinity DataIC50:  320nM. Assay description: Displacement of fluormone PPARgamma green from GST-tagged human PPARgamma-LBD after 2 hrs by fluorescence polarization assay
In DepthDetails ArticlePubMed
TargetNuclear receptor ROR-gamma(Homo sapiens (Human))
Genentech
Curated by ChEMBL
LigandPNGBDBM50106288(CHEMBL3598149 | US9550771, Example 28)
Affinity DataEC50:  9nM. Assay description: Inverse agonist activity at N-terminal 6xHis-tagged human RORc ligand binding domain (241 to 486) expressed in bacterial expression system assessed a...
In DepthDetails ArticlePubMed
TargetNuclear receptor ROR-gamma(Homo sapiens (Human))
Genentech
Curated by ChEMBL
LigandPNGBDBM50106288(CHEMBL3598149 | US9550771, Example 28)
Affinity DataEC50:  10nM. Assay description: Inverse agonist activity at GAL4-fused human RORc expressed in HEK293T cells assessed as suppression of basal transcriptional activity after 20 hrs b...
In DepthDetails ArticlePubMed
TargetOxysterols receptor LXR-alpha(Homo sapiens (Human))
Genentech
Curated by ChEMBL
LigandPNGBDBM50106288(CHEMBL3598149 | US9550771, Example 28)
Affinity DataEC50: >1.00E+4nM. Assay description: Agonist activity at GAL4-fused human LXRalpha expressed in HEK293T cells assessed as activation of basal transcriptional activity after 20 hrs by dua...
In DepthDetails ArticlePubMed