BDBM50106363 CHEMBL3596490
SMILES FC(F)(F)c1cc(COCC2(CCNCC2)c2ccccc2)cc(c1)-c1ccc(cn1)C#N
InChI Key InChIKey=KXYNWEKMOVPIGP-UHFFFAOYSA-N
Data  1 IC50
  Tab Delimited (TSV)   2D SDfile   Computed 3D by Vconf -m prep SDfile
Find this compound or compounds like it in BindingDB:
Activity Spreadsheet -- Enzyme Inhibition Constant Data from BindingDB
Found 1 hit for monomerid = 50106363
TargetSubstance-P receptor(Rattus norvegicus (rat))
Bristol-Myers Squibb
Curated by ChEMBL
LigandPNGBDBM50106363(CHEMBL3596490)
Affinity DataIC50:  8.10nM. Assay description: Displacement of [125I]-substance P from gerbil NK1 receptor expressed in HEK293 cell membranes incubated for 30 mins by liquid scintillation counting...
In DepthDetails ArticlePubMed