BDBM50106403 4-Benzo[1,3]dioxol-5-yl-1-dibutylcarbamoylmethyl-2-(3,4-dimethoxy-phenyl)-pyrrolidine-3-carboxylic acid::CHEMBL129220
SMILES CCCCN(CCCC)C(=O)CN1C[C@@H]([C@H]([C@@H]1c1ccc(OC)c(OC)c1)C(O)=O)c1ccc2OCOc2c1
InChI Key InChIKey=AMGMEJZMJQUMLN-WVLFPKRMSA-N
Data  2 IC50
  Tab Delimited (TSV)   2D SDfile   Computed 3D by Vconf -m prep SDfile
Find this compound or compounds like it in BindingDB:
Activity Spreadsheet -- Enzyme Inhibition Constant Data from BindingDB
Found 2 hits for monomerid = 50106403
TargetEndothelin-1 receptor(RAT)
Abbott Laboratories
Curated by ChEMBL
LigandPNGBDBM50106403(4-Benzo[1,3]dioxol-5-yl-1-dibutylcarbamoylmethyl-2...)
Affinity DataIC50:  0.110nM. Assay description: Binding affinity against endothelin A receptor in MMQ cells in rat
In DepthDetails ArticlePubMed
TargetEndothelin receptor type B(Homo sapiens (Human))
Abbott Laboratories
Curated by ChEMBL
LigandPNGBDBM50106403(4-Benzo[1,3]dioxol-5-yl-1-dibutylcarbamoylmethyl-2...)
Affinity DataIC50:  300nM. Assay description: Binding affinity against endothelin B receptor in porcine cerebellar tissue
In DepthDetails ArticlePubMed