BDBM50106577 2-[(2-Carboxy-3-phenyl-propyl)-hydroxy-phosphinoylmethyl]-pentanedioic acid::CHEMBL340988
SMILES OC(=O)CCC(CP(O)(=O)CC(Cc1ccccc1)C(O)=O)C(O)=O
InChI Key InChIKey=KQIQPDMFXYRLSW-UHFFFAOYSA-N
Data  1 IC50
  Tab Delimited (TSV)   2D SDfile   Computed 3D by Vconf -m prep SDfile
Find this compound or compounds like it in BindingDB:
Activity Spreadsheet -- Enzyme Inhibition Constant Data from BindingDB
Found 1 hit for monomerid = 50106577
TargetGlutamate carboxypeptidase 2(Rattus norvegicus)
Guilford Pharmaceuticals
Curated by ChEMBL
LigandPNGBDBM50106577(2-[(2-Carboxy-3-phenyl-propyl)-hydroxy-phosphinoyl...)
Affinity DataIC50:  2nM. Assay description: Inhibitory concentration against rat brain NAALADase (Folate hydrolase)
In DepthDetails ArticlePubMed