BDBM50106703 6-Hexylsulfanyl-3,4-diphenyl-pyridazine::CHEMBL137431
SMILES CCCCCCSc1cc(-c2ccccc2)c(nn1)-c1ccccc1
InChI Key InChIKey=OUABKTXLLXNPEI-UHFFFAOYSA-N
Data  1 IC50
  Tab Delimited (TSV)   2D SDfile   Computed 3D by Vconf -m prep SDfile
Find this compound or compounds like it in BindingDB:
Activity Spreadsheet -- Enzyme Inhibition Constant Data from BindingDB
Found 1 hit for monomerid = 50106703
TargetSterol O-acyltransferase 1(Rattus norvegicus)
Università
Curated by ChEMBL
LigandPNGBDBM50106703(6-Hexylsulfanyl-3,4-diphenyl-pyridazine | CHEMBL13...)
Affinity DataIC50:  6.20E+4nM. Assay description: In vitro acyl-coenzyme A:cholesterol acyltransferase inhibition in rat liver microsomes
In DepthDetails ArticlePubMed