BDBM50106755 CHEMBL102339::[1-((S)-4-Methyl-2-{2-[4-(3-o-tolyl-ureido)-phenyl]-acetylamino}-pentanoyl)-piperidin-4-yl]-acetic acid
SMILES CC(C)C[C@H](NC(=O)Cc1ccc(NC(=O)Nc2ccccc2C)cc1)C(=O)N1CCC(CC(O)=O)CC1
InChI Key InChIKey=BNJREURCIDOWSG-VWLOTQADSA-N
Data  1 IC50
  Tab Delimited (TSV)   2D SDfile   Computed 3D by Vconf -m prep SDfile
Find this compound or compounds like it in BindingDB:
Activity Spreadsheet -- Enzyme Inhibition Constant Data from BindingDB
Found 1 hit for monomerid = 50106755
TargetIntegrin alpha-4/beta-1(Homo sapiens (Human))
Bayer
Curated by ChEMBL
LigandPNGBDBM50106755(CHEMBL102339 | [1-((S)-4-Methyl-2-{2-[4-(3-o-tolyl...)
Affinity DataIC50:  550nM. Assay description: Inhibition of VCAM-1 binding to integrin alpha4-beta1 of Jurkat cells
In DepthDetails ArticlePubMed