BDBM50106802 CHEMBL319257::N-(5-{2-[1-(3,4-Dimethyl-phenyl)-2-phenyl-ethylamino]-1-hydroxy-ethyl}-2-hydroxy-phenyl)-methanesulfonamide
SMILES Cc1ccc(cc1C)C(Cc1ccccc1)NCC(O)c1ccc(O)c(NS(C)(=O)=O)c1
InChI Key InChIKey=CGQZKFYVAINFRN-UHFFFAOYSA-N
Data  1 KI
  Tab Delimited (TSV)   2D SDfile   Computed 3D by Vconf -m prep SDfile
Find this compound or compounds like it in BindingDB:
Activity Spreadsheet -- Enzyme Inhibition Constant Data from BindingDB
Found 1 hit for monomerid = 50106802
TargetBeta-3 adrenergic receptor(Homo sapiens (Human))
Bristol-Myers Squibb Pharmaceutical Research Institute
Curated by ChEMBL
LigandPNGBDBM50106802(CHEMBL319257 | N-(5-{2-[1-(3,4-Dimethyl-phenyl)-2-...)
Affinity DataKi:  133nM. Assay description: Binding affinity against CHO cells transfected with human beta-3 adrenergic receptor in the presence of [125I]iodocyanopindolol
In DepthDetails ArticlePubMed