BDBM50106837 4-{(R)-1-[(R)-2-Hydroxy-2-(4-hydroxy-3-methanesulfonylamino-phenyl)-ethylamino]-2-phenyl-ethyl}-N-methyl-benzamide::CHEMBL102813
SMILES CNC(=O)c1ccc(cc1)[C@@H](Cc1ccccc1)NC[C@H](O)c1ccc(O)c(NS(C)(=O)=O)c1
InChI Key InChIKey=OFJBFKQSUVELST-QPPBQGQZSA-N
Data  1 KI
  Tab Delimited (TSV)   2D SDfile   Computed 3D by Vconf -m prep SDfile
Find this compound or compounds like it in BindingDB:
Activity Spreadsheet -- Enzyme Inhibition Constant Data from BindingDB
Found 1 hit for monomerid = 50106837
TargetBeta-3 adrenergic receptor(Homo sapiens (Human))
Bristol-Myers Squibb Pharmaceutical Research Institute
Curated by ChEMBL
LigandPNGBDBM50106837(4-{(R)-1-[(R)-2-Hydroxy-2-(4-hydroxy-3-methanesulf...)
Affinity DataKi:  120nM. Assay description: Binding affinity to CHO cells expressing the cloned human beta-3 adrenergic receptor in the presence of [125I]-iodocyanopindolol
In DepthDetails ArticlePubMed