BDBM50106935 (1-{3-(3-Chloro-phenyl)-4-[(R)-4-(1H-indol-3-ylmethyl)-2,5-dioxo-imidazolidin-1-yl]-3-methyl-butyl}-piperidin-4-yl)-ethyl-carbamic acid benzyl ester::CHEMBL319233
SMILES CCN(C1CCN(CCC(C)(Cn2c(O)c(Cc3c[nH]c4ccccc34)[nH]c2=O)c2cccc(Cl)c2)CC1)C(=O)OCc1ccccc1
InChI Key InChIKey=ZBHARDAHKZLOPI-UHFFFAOYSA-N
Data  1 IC50
  Tab Delimited (TSV)   2D SDfile   Computed 3D by Vconf -m prep SDfile
Find this compound or compounds like it in BindingDB:
Activity Spreadsheet -- Enzyme Inhibition Constant Data from BindingDB
Found 1 hit for monomerid = 50106935
TargetC-C chemokine receptor type 5(Homo sapiens (Human))
Merck Research Laboratories
Curated by ChEMBL
LigandPNGBDBM50106935((1-{3-(3-Chloro-phenyl)-4-[(R)-4-(1H-indol-3-ylmet...)
Affinity DataIC50:  77nM. Assay description: Binding affinity against C-C chemokine receptor type 5 stably expressed in Chinese hamster ovary (CHO) cells using [125I]-MIP-1 alpha as the radiolig...
In DepthDetails ArticlePubMed