BDBM50107060 (6S,8aS)-4-Oxo-2-phenylmethanesulfonyl-octahydro-pyrrolo[1,2-a]pyrazine-6-carboxylic acid 4-carbamimidoyl-benzylamide::CHEMBL17288
SMILES NC(=N)c1ccc(CNC(=O)[C@@H]2CC[C@H]3CN(CC(=O)N23)S(=O)(=O)Cc2ccccc2)cc1
InChI Key InChIKey=YAQHMAIZFKGTCA-PMACEKPBSA-N
Data  1 KI
  Tab Delimited (TSV)   2D SDfile   Computed 3D by Vconf -m prep SDfile
Find this compound or compounds like it in BindingDB:
Activity Spreadsheet -- Enzyme Inhibition Constant Data from BindingDB
Found 1 hit for monomerid = 50107060
TargetProthrombin(Rattus norvegicus)
Shire Biochem
Curated by ChEMBL
LigandPNGBDBM50107060((6S,8aS)-4-Oxo-2-phenylmethanesulfonyl-octahydro-p...)
Affinity DataKi:  8nM. Assay description: In vitro ability of the compound to inhibit the amidolytic activity of thrombin
In DepthDetails ArticlePubMed