BDBM50107379 CHEMBL3601467
SMILES Nc1ccc(cn1)-c1nc(N2CCOCC2)c2cccn2n1
InChI Key InChIKey=YBCPJPGLOVNLRF-UHFFFAOYSA-N
Data  1 IC50
  Tab Delimited (TSV)   2D SDfile   Computed 3D by Vconf -m prep SDfile
Find this compound or compounds like it in BindingDB:
Activity Spreadsheet -- Enzyme Inhibition Constant Data from BindingDB
Found 1 hit for monomerid = 50107379
LigandPNGBDBM50107379(CHEMBL3601467)
Affinity DataIC50:  230nM. Assay description: Inhibition of PI3Kalpha (unknown origin) after 60 mins by HTRF assay
In DepthDetails ArticlePubMed