BDBM50107649 3-[3-Cyano-3-(2-diphenylacetylamino-3-m-tolyl-propionylamino)-propoxy]-benzoic acid::CHEMBL140429
SMILES Cc1cccc(C[C@H](NC(=O)C(c2ccccc2)c2ccccc2)C(=O)N[C@@H](CCOc2cccc(c2)C(O)=O)C#N)c1
InChI Key InChIKey=YBMNVNSNGYYGDV-SMCANUKXSA-N
Data  1 IC50
  Tab Delimited (TSV)   2D SDfile   Computed 3D by Vconf -m prep SDfile
Find this compound or compounds like it in BindingDB:
Activity Spreadsheet -- Enzyme Inhibition Constant Data from BindingDB
Found 1 hit for monomerid = 50107649
TargetCathepsin B(Homo sapiens (Human))
Novartis Pharmaceuticals
Curated by ChEMBL
LigandPNGBDBM50107649(3-[3-Cyano-3-(2-diphenylacetylamino-3-m-tolyl-prop...)
Affinity DataIC50:  138nM. Assay description: Inhibitiory activity against recombinant human cathepsin B (cat B) expressed in baculovirus.
In DepthDetails ArticlePubMed