BDBM50107674 Butyric acid 3-(5-methoxy-1H-indole-2-carbonyl)-phenyl ester::CHEMBL139665
SMILES CCCC(=O)Oc1cccc(c1)C(=O)c1cc2cc(OC)ccc2[nH]1
InChI Key InChIKey=FBHAIQXGJNLLRJ-UHFFFAOYSA-N
Data  1 IC50
  Tab Delimited (TSV)   2D SDfile   Computed 3D by Vconf -m prep SDfile
Find this compound or compounds like it in BindingDB:
Activity Spreadsheet -- Enzyme Inhibition Constant Data from BindingDB
Found 1 hit for monomerid = 50107674
TargetTubulin beta-2B chain(Bos taurus)
University Of Regensburg
Curated by ChEMBL
LigandPNGBDBM50107674(Butyric acid 3-(5-methoxy-1H-indole-2-carbonyl)-ph...)
Affinity DataIC50:  850nM. Assay description: Inhibition of tubulin polymerization.
In DepthDetails ArticlePubMed