BDBM50107699 1,7-di[4-(1-methyl-1,2,3,6-tetrahydro-5-pyridinyl)-1,2,5-thiadiazol-3-ylsulfanyl]heptane::CHEMBL140985
SMILES CN1CCC=C(C1)c1nsnc1SCCCCCCCSc1nsnc1C1=CCCN(C)C1
InChI Key InChIKey=BOAPENYDEADGEH-UHFFFAOYSA-N
Data  1 KI  1 EC50
  Tab Delimited (TSV)   2D SDfile   Computed 3D by Vconf -m prep SDfile
Find this compound or compounds like it in BindingDB:
Activity Spreadsheet -- Enzyme Inhibition Constant Data from BindingDB
Found 2 hits for monomerid = 50107699
TargetMuscarinic acetylcholine receptor M1(Homo sapiens (Human))
The University Of Toledo
Curated by ChEMBL
LigandPNGBDBM50107699(1,7-di[4-(1-methyl-1,2,3,6-tetrahydro-5-pyridinyl)...)
Affinity DataKi:  7.60nM. Assay description: Binding affinity towards M1 muscarinic receptor expressed in A9 L cells by diaplacing [3H]-(R)-QNB radioligand.
In DepthDetails ArticlePubMed
TargetMuscarinic acetylcholine receptor M1(Homo sapiens (Human))
The University Of Toledo
Curated by ChEMBL
LigandPNGBDBM50107699(1,7-di[4-(1-methyl-1,2,3,6-tetrahydro-5-pyridinyl)...)
Affinity DataEC50:  180nM. Assay description: Agonistic activity against M1 muscarinic receptor expressed in A9 L cells.
In DepthDetails ArticlePubMed