BDBM50108035 CHEMBL22200::{4-[2-(5-Amino-2-furan-2-yl-pyrazolo[4,3-e][1,2,4]triazolo[1,5-c]pyrimidin-7-yl)-ethyl]-phenoxy}-acetic acid ethyl ester
SMILES CCOC(=O)COc1ccc(CCn2ncc3c2nc(N)n2nc(nc32)-c2ccco2)cc1
InChI Key InChIKey=XUSCPSATZZCPRH-UHFFFAOYSA-N
Data  4 KI
  Tab Delimited (TSV)   2D SDfile   Computed 3D by Vconf -m prep SDfile
Find this compound or compounds like it in BindingDB:
Activity Spreadsheet -- Enzyme Inhibition Constant Data from BindingDB
Found 4 hits for monomerid = 50108035
TargetAdenosine receptor A2a(Homo sapiens (Human))
Università
Curated by ChEMBL
LigandPNGBDBM50108035(CHEMBL22200 | {4-[2-(5-Amino-2-furan-2-yl-pyrazolo...)
Affinity DataKi:  0.430nM. Assay description: Displacement of specific [3H]-SCH- 58261 binding at human Adenosine A2A receptor expressed in HEK-293 cells.
In DepthDetails ArticlePubMed
TargetAdenosine receptor A1(Homo sapiens (Human))
Università
Curated by ChEMBL
LigandPNGBDBM50108035(CHEMBL22200 | {4-[2-(5-Amino-2-furan-2-yl-pyrazolo...)
Affinity DataKi:  4.20E+3nM. Assay description: Displacement of specific [3H]-DPCPX binding at human Adenosine A1 receptor expressed in CHO cells.
In DepthDetails ArticlePubMed
TargetAdenosine receptor A3(Homo sapiens (Human))
Università
Curated by ChEMBL
LigandPNGBDBM50108035(CHEMBL22200 | {4-[2-(5-Amino-2-furan-2-yl-pyrazolo...)
Affinity DataKi: >1.00E+4nM. Assay description: Displacement of specific [3H]-MRE3008-F20 binding at human adenosine A3 receptor expressed in CHO cells.
In DepthDetails ArticlePubMed
TargetAdenosine receptor A2b(Homo sapiens (Human))
Università
Curated by ChEMBL
LigandPNGBDBM50108035(CHEMBL22200 | {4-[2-(5-Amino-2-furan-2-yl-pyrazolo...)
Affinity DataKi: >1.00E+4nM. Assay description: Displacement of specific [3H]-DPCPX binding at human adenosine A2B receptor expressed in HEK-293 cells.
In DepthDetails ArticlePubMed