BDBM50108062 4'-{[3-(4-Nitro-benzyl)-3H-imidazol-4-ylmethyl]-amino}-[1,1';2',1'']terphenyl-3-carboxylic acid 26(FTI-2325)::CHEMBL55484
SMILES OC(=O)c1cccc(c1)-c1ccc(NCc2cncn2Cc2ccc(cc2)[N+]([O-])=O)cc1-c1ccccc1
InChI Key InChIKey=SEKKPFKIZQTNBV-UHFFFAOYSA-N
Data  2 IC50
  Tab Delimited (TSV)   2D SDfile   Computed 3D by Vconf -m prep SDfile
Find this compound or compounds like it in BindingDB:
Activity Spreadsheet -- Enzyme Inhibition Constant Data from BindingDB
Found 2 hits for monomerid = 50108062
LigandPNGBDBM50108062(4'-{[3-(4-Nitro-benzyl)-3H-imidazol-4-ylmethyl]-am...)
Affinity DataIC50:  3.90E+3nM. Assay description: Inhibition of partially purified Geranylgeranyl transferase type I (GGTase-I) from human Burkitt lymphoma (Daudi) cells
In DepthDetails ArticlePubMed
TargetDimer of Protein farnesyltransferase subunit beta(Homo sapiens (Human))
Yale University
Curated by ChEMBL
LigandPNGBDBM50108062(4'-{[3-(4-Nitro-benzyl)-3H-imidazol-4-ylmethyl]-am...)
Affinity DataIC50:  450nM. Assay description: Inhibition of farnesyltransferase from human Burkitt lymphoma (Daudi) cells
In DepthDetails ArticlePubMed