BDBM50108116 CHEMBL3601923
SMILES COc1ncc(cc1NS(=O)(=O)c1ccc(F)cc1)-c1ccc2nc(NC(=O)NC3CC3)nn2c1
InChI Key InChIKey=YVAOMSDQXISTTH-UHFFFAOYSA-N
Data  5 IC50
  Tab Delimited (TSV)   2D SDfile   Computed 3D by Vconf -m prep SDfile
Find this compound or compounds like it in BindingDB:
Activity Spreadsheet -- Enzyme Inhibition Constant Data from BindingDB
Found 5 hits for monomerid = 50108116
TargetPhosphatidylinositol 4,5-bisphosphate 3-kinase catalytic subunit alpha isoform(Homo sapiens (Human))
Xi'An Jiaotong University
Curated by ChEMBL
LigandPNGBDBM50108116(CHEMBL3601923)
Affinity DataIC50:  7nM. Assay description: Inhibition of PI3Kalpha (unknown origin) assessed as reduction of ATP level after 40 mins by luciferase based luminescence assay
In DepthDetails ArticlePubMed
TargetPhosphatidylinositol 4,5-bisphosphate 3-kinase catalytic subunit beta isoform(Homo sapiens (Human))
Xi'An Jiaotong University
Curated by ChEMBL
LigandPNGBDBM50108116(CHEMBL3601923)
Affinity DataIC50:  47nM. Assay description: Inhibition of PI3Kbeta (unknown origin) assessed as reduction of ATP level after 40 mins by luciferase based luminescence assay
In DepthDetails ArticlePubMed
TargetSerine/threonine-protein kinase mTOR(Homo sapiens (Human))
Xi'An Jiaotong University
Curated by ChEMBL
LigandPNGBDBM50108116(CHEMBL3601923)
Affinity DataIC50:  275nM. Assay description: Inhibition of mTOR (unknown origin) assessed as reduction of ATP level after 40 mins by luciferase based luminescence assay
In DepthDetails ArticlePubMed
TargetPhosphatidylinositol 4,5-bisphosphate 3-kinase catalytic subunit delta isoform(Homo sapiens (Human))
Xi'An Jiaotong University
Curated by ChEMBL
LigandPNGBDBM50108116(CHEMBL3601923)
Affinity DataIC50:  16nM. Assay description: Inhibition of PI3Kdelta (unknown origin) assessed as reduction of ATP level after 40 mins by luciferase based luminescence assay
In DepthDetails ArticlePubMed
TargetPhosphatidylinositol 4,5-bisphosphate 3-kinase catalytic subunit gamma isoform(Homo sapiens (Human))
Xi'An Jiaotong University
Curated by ChEMBL
LigandPNGBDBM50108116(CHEMBL3601923)
Affinity DataIC50:  14nM. Assay description: Inhibition of PI3Kgamma (unknown origin) assessed as reduction of ATP level after 40 mins by luciferase based luminescence assay
In DepthDetails ArticlePubMed