BDBM50108482 2-{3-[3'-((R)-2-Carboxy-1-phenyl-ethylsulfamoyl)-4'-methoxy-biphenyl-3-yl]-ureido}-3H-benzoimidazol-1-ium
SMILES COc1ccc(cc1S(=O)(=O)N[C@H](CC(O)=O)c1ccccc1)-c1cccc(NC(=O)Nc2[nH]c3ccccc3[nH+]2)c1
InChI Key InChIKey=DKCBOEVMYBPSHB-RUZDIDTESA-O
Data  1 KI
  Tab Delimited (TSV)   2D SDfile   Computed 3D by Vconf -m prep SDfile
Find this compound or compounds like it in BindingDB:
Activity Spreadsheet -- Enzyme Inhibition Constant Data from BindingDB
Found 1 hit for monomerid = 50108482
TargetIntegrin alpha-V/beta-3(Homo sapiens (Human))
Bayer
Curated by ChEMBL
LigandPNGBDBM50108482(2-{3-[3'-((R)-2-Carboxy-1-phenyl-ethylsulfamoyl)-4...)
Affinity DataKi:  0.700nM. Assay description: Displacement of 125-I echistatin from Vitronectin receptor (alpha v beta3)
In DepthDetails ArticlePubMed