BDBM50108538 4-[2-(2-{4-[2-(2-Acetylamino-3-methyl-butyrylamino)-3-carbamoyl-propionylamino]-3-hydroxy-6-methyl-heptanoylamino}-3-methyl-butyrylamino)-propionylamino]-4-(1-carboxy-2-phenyl-ethylcarbamoyl)-butyric acid(N-acetyl-Val-Asn-Sta-Val-Ala-Glu-Phe-COOH)::CHEMBL315706
SMILES CC(C)CC(NC(=O)[C@H](CC(N)=O)NC(=O)[C@@H](NC(C)=O)C(C)C)C(O)CC(=O)N[C@@H](C(C)C)C(=O)N[C@@H](C)C(=O)N[C@@H](CCC(O)=O)C(=O)N[C@@H](Cc1ccccc1)C(O)=O
InChI Key InChIKey=ZWEOSGYJDKFDML-ZKZXMJOLSA-N
Data  1 IC50
  Tab Delimited (TSV)   2D SDfile   Computed 3D by Vconf -m prep SDfile
Find this compound or compounds like it in BindingDB:
Activity Spreadsheet -- Enzyme Inhibition Constant Data from BindingDB
Found 1 hit for monomerid = 50108538
TargetBeta-secretase 1(Homo sapiens (Human))
TBA
Curated by ChEMBL
LigandPNGBDBM50108538(4-[2-(2-{4-[2-(2-Acetylamino-3-methyl-butyrylamino...)
Affinity DataIC50:  500nM. Assay description: Inhibition of human brain beta-secretase, using MBPC125Swe (maltose-binding-protein C-125 Swedish) assay
In DepthDetails ArticlePubMed