BDBM50108551 CHEMBL2370121::NH2-Lys-Thr-Glu-Glu-Ile-Ser-Glu-Val-Asn-Sta(S-OH)-A-A-E-F
SMILES CC[C@H](C)[C@H](NC(=O)[C@H](CCC(O)=O)NC(=O)[C@H](CCC(O)=O)NC(=O)[C@@H](NC(=O)[C@@H](N)CCCCN)[C@@H](C)O)C(=O)N[C@@H](CO)C(=O)N[C@@H](CCC(O)=O)C(=O)N[C@@H](C(C)C)C(=O)N[C@@H](CC(N)=O)C(=O)N[C@@H](CC(C)C)[C@@H](O)CC(=O)N[C@@H](C)C(=O)N[C@@H](C)C(=O)N[C@@H](CCC(O)=O)C(=O)N[C@@H](Cc1ccccc1)C(O)=O
InChI Key InChIKey=KPVMIAVXWMUAFM-SNTSIXRVSA-N
Data  1 IC50
  Tab Delimited (TSV)   2D SDfile   Computed 3D by Vconf -m prep SDfile
Find this compound or compounds like it in BindingDB:
Activity Spreadsheet -- Enzyme Inhibition Constant Data from BindingDB
Found 1 hit for monomerid = 50108551
TargetBeta-secretase 1(Homo sapiens (Human))
TBA
Curated by ChEMBL
LigandPNGBDBM50108551(CHEMBL2370121 | NH2-Lys-Thr-Glu-Glu-Ile-Ser-Glu-Va...)
Affinity DataIC50:  500nM. Assay description: Inhibition of human brain beta-secretase, using MBPC125Swe (maltose-binding-protein C-125 Swedish) assay
In DepthDetails ArticlePubMed