BDBM50108854 CHEMBL158806::[1-(1-Benzyl-3-tert-butylsulfanyl-2-oxo-propylcarbamoyl)-2-phenyl-ethyl]-carbamic acid pyridin-3-ylmethyl ester
SMILES CC(C)(C)SCC(=O)[C@H](Cc1ccccc1)NC(=O)[C@H](Cc1ccccc1)NC(=O)OCc1cccnc1
InChI Key InChIKey=DMQFSUSPFZOSOL-UIOOFZCWSA-N
Data  1 KI
  Tab Delimited (TSV)   2D SDfile   Computed 3D by Vconf -m prep SDfile
Find this compound or compounds like it in BindingDB:
Activity Spreadsheet -- Enzyme Inhibition Constant Data from BindingDB
Found 1 hit for monomerid = 50108854
TargetCruzipain(Trypanosoma cruzi)
University Of California
Curated by ChEMBL
LigandPNGBDBM50108854(CHEMBL158806 | [1-(1-Benzyl-3-tert-butylsulfanyl-2...)
Affinity DataKi:  4.60nM. Assay description: Inhibitory activity against cruzain, the major cysteine protease found in T. cruzi
In DepthDetails ArticlePubMed