BDBM50108860 CHEMBL348163::[1-(1-Benzyl-3-tert-butylsulfanyl-2-oxo-propylcarbamoyl)-3-methyl-butyl]-carbamic acid pyridin-2-ylmethyl ester
SMILES CC(C)C[C@H](NC(=O)OCc1ccccn1)C(=O)N[C@@H](Cc1ccccc1)C(=O)CSC(C)(C)C
InChI Key InChIKey=FODNTXWSCLRRDZ-GOTSBHOMSA-N
Data  1 KI
  Tab Delimited (TSV)   2D SDfile   Computed 3D by Vconf -m prep SDfile
Find this compound or compounds like it in BindingDB:
Activity Spreadsheet -- Enzyme Inhibition Constant Data from BindingDB
Found 1 hit for monomerid = 50108860
TargetCruzipain(Trypanosoma cruzi)
University Of California
Curated by ChEMBL
LigandPNGBDBM50108860(CHEMBL348163 | [1-(1-Benzyl-3-tert-butylsulfanyl-2...)
Affinity DataKi:  13.8nM. Assay description: Inhibitory activity against cruzain, the major cysteine protease found in T. cruzi
In DepthDetails ArticlePubMed