BDBM50108983 CHEMBL3597320
SMILES O[C@@H]1Cc2cccc(OCCF)c2C[C@H]1N1CCC(CC1)C(=O)c1ccc(F)cc1
InChI Key InChIKey=HPFMDGHQRJOFBK-FGZHOGPDSA-N
Data  2 KI
  Tab Delimited (TSV)   2D SDfile   Computed 3D by Vconf -m prep SDfile
Find this compound or compounds like it in BindingDB:
Activity Spreadsheet -- Enzyme Inhibition Constant Data from BindingDB
Found 2 hits for monomerid = 50108983
TargetVesicular acetylcholine transporter(Homo sapiens (Human))
Washington University
Curated by ChEMBL
LigandPNGBDBM50108983(CHEMBL3597320)
Affinity DataKi:  1.60nM. Assay description: Displacement of [3H]-vesamicol from human VAChT after 24 hrs by by liquid scintillation spectrometry analysis
In DepthDetails ArticlePubMed
TargetSigma non-opioid intracellular receptor 1(Cavia porcellus (Guinea pig))
Washington University
Curated by ChEMBL
LigandPNGBDBM50108983(CHEMBL3597320)
Affinity DataKi:  821nM. Assay description: Displacement of (+)-[3H]pentazocine from sigma1 receptor in guinea pig brain membrane homogenates
In DepthDetails ArticlePubMed