BDBM50109053 3-{1-[2-(2,3-Dihydro-benzo[1,4]dioxin-5-yloxy)-ethyl]-1,2,3,6-tetrahydro-pyridin-4-yl}-1H-pyrrolo[2,3-b]pyridine::CHEMBL318738
SMILES C(CN1CCC(=CC1)c1c[nH]c2ncccc12)Oc1cccc2OCCOc12
InChI Key InChIKey=KINTWXKYQAVVRH-UHFFFAOYSA-N
Data  4 KI  1 IC50
  Tab Delimited (TSV)   2D SDfile   Computed 3D by Vconf -m prep SDfile
Find this compound or compounds like it in BindingDB:
Activity Spreadsheet -- Enzyme Inhibition Constant Data from BindingDB
Found 5 hits for monomerid = 50109053
TargetSodium-dependent serotonin transporter(Rattus norvegicus (rat))
Wyeth-Ayerst Research Laboratories
Curated by ChEMBL
LigandPNGBDBM50109053(3-{1-[2-(2,3-Dihydro-benzo[1,4]dioxin-5-yloxy)-eth...)
Affinity DataKi:  18nM. Assay description: Affinity of the compound for RB Serotonin transporter was determined in vitro by incubating compound
In DepthDetails ArticlePubMed
TargetAlpha-1A/Alpha-1B/Alpha-1D adrenergic receptor(Rattus norvegicus (rat))
Wyeth-Ayerst Research Laboratories
Curated by ChEMBL
LigandPNGBDBM50109053(3-{1-[2-(2,3-Dihydro-benzo[1,4]dioxin-5-yloxy)-eth...)
Affinity DataKi:  33nM. Assay description: Antagonism of 5-hydroxytryptamine 1A receptor determined in vitro
In DepthDetails ArticlePubMed
Target5-hydroxytryptamine receptor 1A(Homo sapiens (Human))
Wyeth-Ayerst Research Laboratories
Curated by ChEMBL
LigandPNGBDBM50109053(3-{1-[2-(2,3-Dihydro-benzo[1,4]dioxin-5-yloxy)-eth...)
Affinity DataKi:  44nM. Assay description: In vitro binding affinity towards Human 5-hydroxytryptamine 1A receptor by the displacement of [3H]-8-OH-DPAT
In DepthDetails ArticlePubMed
TargetSodium-dependent serotonin transporter(Homo sapiens (Human))
Wyeth-Ayerst Research Laboratories
Curated by ChEMBL
LigandPNGBDBM50109053(3-{1-[2-(2,3-Dihydro-benzo[1,4]dioxin-5-yloxy)-eth...)
Affinity DataKi:  276nM. Assay description: Affinity for HC Serotonin transporter determined in vitro by incubating compound and [3H]-5-HT with human carcinoma (Jar cells), previously treated w...
In DepthDetails ArticlePubMed
Target5-hydroxytryptamine receptor 1A(Homo sapiens (Human))
Wyeth-Ayerst Research Laboratories
Curated by ChEMBL
LigandPNGBDBM50109053(3-{1-[2-(2,3-Dihydro-benzo[1,4]dioxin-5-yloxy)-eth...)
Affinity DataIC50:  969nM. Assay description: In vitro binding affinity towards Human 5-hydroxytryptamine 1A receptor by the displacement of [3H]-8-OH-DPAT
In DepthDetails ArticlePubMed