BDBM50109085 (3-Azepan-1-yl-propyl)-benzo[1,3]dioxol-5-ylmethyl-[3-(3-nitro-phenyl)-isoxazol-5-yl]-amine::CHEMBL111109
SMILES [O-][N+](=O)c1cccc(c1)-c1cc([o+][n-]1)N(CCCN1CCCCCC1)Cc1ccc2OCOc2c1
InChI Key InChIKey=SUTYVKBDMFTKBS-UHFFFAOYSA-N
Data  3 IC50
  Tab Delimited (TSV)   2D SDfile   Computed 3D by Vconf -m prep SDfile
Find this compound or compounds like it in BindingDB:
Activity Spreadsheet -- Enzyme Inhibition Constant Data from BindingDB
Found 3 hits for monomerid = 50109085
TargetProteinase-activated receptor 1(Homo sapiens (Human))
Merck Research Laboratories
Curated by ChEMBL
LigandPNGBDBM50109085((3-Azepan-1-yl-propyl)-benzo[1,3]dioxol-5-ylmethyl...)
Affinity DataIC50: >1.00E+4nM. Assay description: Inhibition of secretion of radiolabeled serotonin from washed human platelets stimulated by 1 nM thrombin
In DepthDetails ArticlePubMed
TargetProteinase-activated receptor 1(Homo sapiens (Human))
Merck Research Laboratories
Curated by ChEMBL
LigandPNGBDBM50109085((3-Azepan-1-yl-propyl)-benzo[1,3]dioxol-5-ylmethyl...)
Affinity DataIC50:  830nM. Assay description: Displacement of [3H]-SFFLRR-NH2 from human thrombin receptor PAR-1
In DepthDetails ArticlePubMed
TargetProteinase-activated receptor 1(Homo sapiens (Human))
Merck Research Laboratories
Curated by ChEMBL
LigandPNGBDBM50109085((3-Azepan-1-yl-propyl)-benzo[1,3]dioxol-5-ylmethyl...)
Affinity DataIC50:  1.02E+3nM. Assay description: Antagonistic activity against thrombin receptor, inhibition of secreted radiolabeled [3H]-5-HT from washed human platelets stimulated by 3 microM thr...
In DepthDetails ArticlePubMed