BDBM50109199 CHEMBL3601090
SMILES CCCCCCCCCCCCNC(=O)c1ccc(NC(=O)c2cccc(CN3[C@H](Cc4ccccc4)COC3=O)c2)cc1
InChI Key InChIKey=KUYBUYXZVCDEPQ-UUWRZZSWSA-N
Data  2 EC50
  Tab Delimited (TSV)   2D SDfile   Computed 3D by Vconf -m prep SDfile
Find this compound or compounds like it in BindingDB:
Activity Spreadsheet -- Enzyme Inhibition Constant Data from BindingDB
Found 2 hits for monomerid = 50109199
TargetPeroxisome proliferator-activated receptor gamma(Homo sapiens (Human))
Iqm-Csic
Curated by ChEMBL
LigandPNGBDBM50109199(CHEMBL3601090)
Affinity DataEC50: >1.00E+5nM. Assay description: Agonist activity at human PPARgamma transfected in human MCF7 cells after 16 hrs by luciferase reporter gene assay
In DepthDetails ArticlePubMed
TargetPeroxisome proliferator-activated receptor alpha(Homo sapiens (Human))
Iqm-Csic
Curated by ChEMBL
LigandPNGBDBM50109199(CHEMBL3601090)
Affinity DataEC50:  6.62E+3nM. Assay description: Agonist activity at human PPARalpha transfected in human MCF7 cells after 16 hrs by luciferase reporter gene assay
In DepthDetails ArticlePubMed